Target
Potassium voltage-gated channel subfamily H member 2
Ligand
BDBM50185906
Substrate
Meas. Tech.
ChEMBL_351827 (CHEMBL870781)
Ki
>10000±n/a nM
Citation
 Ghosh, SElder, AGuo, JMani, UPatane, MCarson, KYe, QBennett, RChi, SJenkins, TGuan, BKolbeck, RSmith, SZhang, CLaRosa, GJaffee, BYang, HEddy, PLu, CUttamsingh, VHorlick, RHarriman, GFlynn, D Design, synthesis, and progress toward optimization of potent small molecule antagonists of CC chemokine receptor 8 (CCR8). J Med Chem 49:2669-72 (2006)  
Target
Name:
Potassium voltage-gated channel subfamily H member 2
Synonyms:
1,3-beta-glucan synthase component GLS2 ERG Eag-related protein 1 Ether-a-go-go-related gene (HERG) Ether-a-go-go-related gene potassium channel 1 Ether-a-go-go-related gene potassium channel 1 (hERG1) Ether-a-go-go-related protein 1 H-ERG KCNH2 Potassium voltage-gated channel subfamily H member 2 (hERG) Voltage-gated potassium channel subunit Kv11.1 hERG Potassium Channel 1 | putative potassium channel subunit
Type:
Multi-pass membrane protein
Mol. Mass.:
126672.65
Organism:
Homo sapiens (Human)
Description:
Q12809
Residue:
1159
  
Inhibitor
Name:
BDBM50185906
Synonyms:
1-[3-(2-chlorophenoxy)benzyl]-4-{[(1-ethyl-4-phenylpiperidin-4-yl)carbonyl]amino} piperidine-4-carboxylic acid | CHEMBL436753
Type:
Small organic molecule
Emp. Form.:
C33H38ClN3O4
Mol. Mass.:
576.126
SMILES:
CCN1CCC(CC1)(C(=O)NC1(CCN(Cc2cccc(Oc3ccccc3Cl)c2)CC1)C(O)=O)c1ccccc1
: