Target
Prostaglandin G/H synthase 2
Ligand
BDBM50186095
Substrate
Meas. Tech.
ChEMBL_374847 (CHEMBL864093)
IC50
2100±n/a nM
Citation
 Caturla, FAmat, MReinoso, RFCalaf, EWarrellow, G Racemic and chiral sulfoxides as potential prodrugs of 4-pyrone COX-2 inhibitors. Bioorg Med Chem Lett 16:3605-8 (2006)  
Target
Name:
Prostaglandin G/H synthase 2
Synonyms:
COX2 Cyclooxygenase 2 (COX-2) Cyclooxygenase-2 (COX-2 AA) Cyclooxygenase-2 (COX-2) PGH2_HUMAN PHS II Prostaglandin E synthase/G/H synthase 2 Prostaglandin-endoperoxide synthase 2
Type:
Enzyme
Mol. Mass.:
69003.89
Organism:
Homo sapiens (Human)
Description:
Recombinant Cox-2 provided by Cayman (Cayman Chemical Co.,Ann Arbor, MI).
Residue:
604
  
Inhibitor
Name:
BDBM50186095
Synonyms:
(R)-3-(2,4-difluorophenoxy)-6-methyl-2-(4-(methylsulfinyl)phenyl)-4H-pyran-4-one 3-(2,4-difluorophenoxy)-6-methyl-2-(4-(methylsulfinyl)phenyl)-4H-pyran-4-one | CHEMBL209883
Type:
Small organic molecule
Emp. Form.:
C19H14F2O4S
Mol. Mass.:
376.374
SMILES:
Cc1cc(=O)c(Oc2ccc(F)cc2F)c(o1)-c1ccc(cc1)[S@@](C)=O
: