Target
Glutathione S-transferase P
Ligand
BDBM50186231
Substrate
Meas. Tech.
ChEMBL_366183 (CHEMBL853398)
IC50
4000±n/a nM
Citation
 Maeda, DYMahajan, SSAtkins, WMZebala, JA Bivalent inhibitors of glutathione S-transferase: the effect of spacer length on isozyme selectivity. Bioorg Med Chem Lett 16:3780-3 (2006)  
Target
Name:
Glutathione S-transferase P
Synonyms:
FAEES3 GST3 GSTP1-1 Glutathione S-transferase Glutathione S-transferase P Glutathione transferase (GST)
Type:
Enzyme
Mol. Mass.:
23353.53
Organism:
Homo sapiens (Human)
Description:
P09211
Residue:
210
  
Inhibitor
Name:
BDBM50186231
Synonyms:
(2,3-Dichloro-4-(2-methylene-1-oxobutyl)phenoxy)acetic acid ETHACRYNIC ACID Etacrinic acid Hydromedin [2,3-dichloro-4-(2-methylidenebutanoyl)phenoxy]acetic acid | jm5b01461, Compound 72
Type:
Small organic molecule
Emp. Form.:
C13H12Cl2O4
Mol. Mass.:
303.138
SMILES:
CCC(=C)C(=O)c1ccc(OCC(O)=O)c(Cl)c1Cl
: