Target
E3 ubiquitin-protein ligase Mdm2
Ligand
BDBM50605125
Substrate
Meas. Tech.
ChEMBL_2250443 (CHEMBL5164653)
Ki
0.800000±n/a nM
Citation
 Zhang, SYan, ZLi, YGong, YLyu, XLou, JZhang, DMeng, XZhao, Y Structure-Based Discovery of MDM2/4 Dual Inhibitors that Exert Antitumor Activities against MDM4-Overexpressing Cancer Cells. J Med Chem 65:6207-6230 (2022) Target
Name:
E3 ubiquitin-protein ligase Mdm2
Synonyms:
Double minute 2 protein E3 ubiquitin-protein ligase Mdm2 (p53-binding protein Mdm2) Human Double Minute 2 (HDM2) MDM2-MDMX p53-Binding Protein MDM2 | p53-binding protein
Type:
Oncoprotein
Mol. Mass.:
55196.54
Organism:
Homo sapiens (Human)
Description:
Q00987
Residue:
491
  
Inhibitor
Name:
BDBM50605125
Synonyms:
CHEMBL5197279
Type:
Small organic molecule
Emp. Form.:
C35H37Cl2F2N5O4
Mol. Mass.:
700.602
SMILES:
COc1cc(ccc1NC(=O)[C@@H]1N[C@@H](CC(C)(C)C)[C@@](CNCc2cnc[nH]2)([C@H]1c1cccc(Cl)c1F)c1ccc(Cl)cc1F)C(O)=O
: