Target
Urokinase-type plasminogen activator
Ligand
BDBM50187800
Substrate
Meas. Tech.
ChEMBL_385594 (CHEMBL869127)
Ki
>150000±n/a nM
Citation
 Sperandio, DTai, VWLohman, JHirschbein, BMendonca, RLee, CSSpencer, JRJanc, JNguyen, MBeltman, JSprengeler, PScheerens, HLin, TLiu, LGadre, AKellogg, AGreen, MJMcGrath, ME Novel, potent, selective, and orally bioavailable human betaII-tryptase inhibitors. Bioorg Med Chem Lett 16:4085-9 (2006)  
Target
Name:
Urokinase-type plasminogen activator
Synonyms:
3.4.21.73 U-plasminogen activator Urokinase Urokinase-type plasminogen activator chain B Urokinase-type plasminogen activator short chain A uPA
Type:
Enzyme
Mol. Mass.:
48528.62
Organism:
Homo sapiens (Human)
Description:
P00749
Residue:
431
  
Inhibitor
Name:
BDBM50187800
Synonyms:
(S)-ethyl 1-(5-(4-phenethoxybenzyl)-1,2,4-oxadiazol-3-yl)-6-amino-1-oxohexan-2-ylcarbamate | CHEMBL211561
Type:
Small organic molecule
Emp. Form.:
C26H32N4O5
Mol. Mass.:
480.5561
SMILES:
CCOC(=O)N[C@@H](CCCCN)C(=O)c1noc(Cc2ccc(OCCc3ccccc3)cc2)n1
: