Target
5-hydroxytryptamine receptor 2C
Ligand
BDBM50188125
Substrate
Meas. Tech.
ChEMBL_384996 (CHEMBL869818)
Ki
911±n/a nM
Citation
 Huck, BRLlamas, LRobarge, MJDent, TCSong, JHodnick, WFCrumrine, CStricker-Krongrad, AHarrington, JBrunden, KRBennani, YL The design and synthesis of a tricyclic single-nitrogen scaffold that serves as a 5-HT2C receptor agonist. Bioorg Med Chem Lett 16:4130-4 (2006)  
Target
Name:
5-hydroxytryptamine receptor 2C
Synonyms:
5-HT-1C 5-HT1C 5-HT2C-INI 5-HTR2C 5-hydroxytryptamine receptor 2C (5-HT-2C) 5HT-1C HTR1C Serotonin (5-HT3) receptor Serotonin Receptor 2C
Type:
G Protein-Coupled Receptor (GPCR)
Mol. Mass.:
51836.79
Organism:
Homo sapiens (Human)
Description:
P28335
Residue:
458
  
Inhibitor
Name:
BDBM50188125
Synonyms:
(3aS,8R,8aS)-6-chloro-8-methyl-1,2,3,3a,8,8a-hexahydro-indeno[1,2-c]pyrrole | CHEMBL438611
Type:
Small organic molecule
Emp. Form.:
C12H14ClN
Mol. Mass.:
207.699
SMILES:
C[C@@H]1[C@@H]2CNC[C@@H]2c2ccc(Cl)cc12
: