Target
Galanin receptor type 3
Ligand
BDBM50189600
Substrate
Meas. Tech.
ChEMBL_368823 (CHEMBL864918)
Ki
150±n/a nM
Citation
 Konkel, MJLagu, BBoteju, LWJimenez, HNoble, SWalker, MWChandrasena, GBlackburn, TPNikam, SSWright, JLKornberg, BEGregory, TPugsley, TAAkunne, HZoski, KWise, LD 3-arylimino-2-indolones are potent and selective galanin GAL3 receptor antagonists. J Med Chem 49:3757-8 (2006)  
Target
Name:
Galanin receptor type 3
Synonyms:
GALNR3 GALR3_HUMAN Galanin receptor 3 | Galanin receptor type 3
Type:
Enzyme Catalytic Domain
Mol. Mass.:
39599.97
Organism:
Homo sapiens (Human)
Description:
Galanin R3 GALR3 HUMAN::O60755
Residue:
368
  
Inhibitor
Name:
BDBM50189600
Synonyms:
(E)-1-allyl-3-(3,4-dichlorophenylimino)indolin-2-one | CHEMBL212729
Type:
Small organic molecule
Emp. Form.:
C17H12Cl2N2O
Mol. Mass.:
331.196
SMILES:
Clc1ccc(cc1Cl)\N=C1\C(=O)N(CC=C)c2ccccc12
: