Target
Metabotropic glutamate receptor 1
Ligand
BDBM50190236
Substrate
Meas. Tech.
ChEMBL_406111 (CHEMBL912698)
IC50
21±n/a nM
Citation
 Zheng, GZBhatia, PKolasa, TPatel, MEl Kouhen, OFChang, RUchic, MEMiller, LBaker, SLehto, SGHonore, PWetter, JMMarsh, KCMoreland, RBBrioni, JDStewart, AO Correlation between brain/plasma ratios and efficacy in neuropathic pain models of selective metabotropic glutamate receptor 1 antagonists. Bioorg Med Chem Lett 16:4936-40 (2006)  
Target
Name:
Metabotropic glutamate receptor 1
Synonyms:
GRM1_RAT Grm1 Metabotropic glutamate receptor Mglur1 metabotropic glutamate 1/5-D metabotropic glutamate receptor 1 isoform alpha precursor
Type:
Enzyme Catalytic Domain
Mol. Mass.:
133240.47
Organism:
RAT
Description:
metabotropic glutamate 1/2 0 RAT::P23385
Residue:
1199
  
Inhibitor
Name:
BDBM50190236
Synonyms:
9-dimethylamino-3-(3-fluoro-4-methyl-phenyl)-3H-pyrido[4',3':4,5]thieno[3,2-d]pyrimidin-4-one | CHEMBL215240
Type:
Small organic molecule
Emp. Form.:
C18H15FN4OS
Mol. Mass.:
354.401
SMILES:
CN(C)c1cncc2sc3c(ncn(-c4ccc(C)c(F)c4)c3=O)c12
: