Target
Receptor-type tyrosine-protein phosphatase mu
Ligand
BDBM50558488
Substrate
Meas. Tech.
ChEMBL_2262151 (CHEMBL5217162)
IC50
>200000±n/a nM
Citation
 He, RWang, JYu, ZHMoyers, JSMichael, MDDurham, TBCramer, JWQian, YLin, AWu, LNoinaj, NBarrett, DGZhang, ZY Structure-Based Design of Active-Site-Directed, Highly Potent, Selective, and Orally Bioavailable Low-Molecular-Weight Protein Tyrosine Phosphatase Inhibitors. J Med Chem 65:13892-13909 (2022) Target
Name:
Receptor-type tyrosine-protein phosphatase mu
Synonyms:
PTPRL1 PTPRM_HUMAN Receptor-type tyrosine-protein phosphatase mu | Receptor-type tyrosine-protein phosphatase mu (PTPμ)
Type:
Protein
Mol. Mass.:
163683.56
Organism:
Homo sapiens (Human)
Description:
P28827
Residue:
1452
  
Inhibitor
Name:
BDBM50558488
Synonyms:
CHEMBL4794972
Type:
Small organic molecule
Emp. Form.:
C15H13Br2NO4S
Mol. Mass.:
463.141
SMILES:
Cc1c(Br)cc(NC(=O)C(c2ccccc2)S(O)(=O)=O)cc1Br
: