Target
Dual specificity protein phosphatase CDC14A
Ligand
BDBM50558488
Substrate
Meas. Tech.
ChEMBL_2262155 (CHEMBL5217166)
IC50
>200000±n/a nM
Citation
 He, RWang, JYu, ZHMoyers, JSMichael, MDDurham, TBCramer, JWQian, YLin, AWu, LNoinaj, NBarrett, DGZhang, ZY Structure-Based Design of Active-Site-Directed, Highly Potent, Selective, and Orally Bioavailable Low-Molecular-Weight Protein Tyrosine Phosphatase Inhibitors. J Med Chem 65:13892-13909 (2022) Target
Name:
Dual specificity protein phosphatase CDC14A
Synonyms:
3.1.3.16 CC14A_HUMAN CDC14A
Type:
Mol. Mass.:
66598.40
Organism:
Homo sapiens (Human)
Description:
Q9UNH5
Residue:
594
  
Inhibitor
Name:
BDBM50558488
Synonyms:
CHEMBL4794972
Type:
Small organic molecule
Emp. Form.:
C15H13Br2NO4S
Mol. Mass.:
463.141
SMILES:
Cc1c(Br)cc(NC(=O)C(c2ccccc2)S(O)(=O)=O)cc1Br
: