Target
Transient receptor potential cation channel subfamily V member 1
Ligand
BDBM50191726
Substrate
Meas. Tech.
ChEMBL_404278 (CHEMBL912134)
IC50
1.4±n/a nM
Citation
 Zheng, XHodgetts, KJBrielmann, HHutchison, ABurkamp, FBrian Jones, ABlurton, PClarkson, RChandrasekhar, JBakthavatchalam, RDe Lombaert, SCrandall, MCortright, DBlum, CA From arylureas to biarylamides to aminoquinazolines: discovery of a novel, potent TRPV1 antagonist. Bioorg Med Chem Lett 16:5217-21 (2006)  
Target
Name:
Transient receptor potential cation channel subfamily V member 1
Synonyms:
Capsaicin receptor TRPV1_RAT Trpv1 Vanilloid VR1 Vanilloid receptor 1 (VRI/TRPV1) Vanilloid receptor type 1-like (TrpV1/Vr1) Vr1l | osm-9-like TRP channel 1
Type:
Transient Receptor
Mol. Mass.:
94956.12
Organism:
Rattus norvegicus (rat)
Description:
O35433
Residue:
838
  
Inhibitor
Name:
BDBM50191726
Synonyms:
(4-Trifluoromethylphenyl)-[7-(3-trifluoromethylpyridin-2-yl)-quinazolin-4-yl]amine N-(4-(trifluoromethyl)phenyl)-7-(3-(trifluoromethyl)pyridin-2-yl)quinazolin-4-amine
Type:
Small organic molecule
Emp. Form.:
C21H12F6N4
Mol. Mass.:
434.3372
SMILES:
FC(F)(F)c1ccc(Nc2ncnc3cc(ccc23)-c2ncccc2C(F)(F)F)cc1
: