Target
Oxysterols receptor LXR-alpha
Ligand
BDBM50192144
Substrate
Meas. Tech.
ChEMBL_406039 (CHEMBL912135)
IC50
6±n/a nM
Citation
 Panday, NBenz, JBlum-Kaelin, DBourgeaux, VDehmlow, HHartman, PKuhn, BRatni, HWarot, XWright, MB Synthesis and evaluation of anilinohexafluoroisopropanols as activators/modulators of LXRalpha and beta. Bioorg Med Chem Lett 16:5231-7 (2006)  
Target
Name:
Oxysterols receptor LXR-alpha
Synonyms:
LXRA Liver X receptor alpha Liver X receptor alpha (NR1H3) NR1H3 Nuclear orphan receptor LXR-alpha | Nuclear receptor subfamily 1 group H member 3
Type:
Enzyme Catalytic Domain
Mol. Mass.:
50403.85
Organism:
Homo sapiens (Human)
Description:
Q13133
Residue:
447
  
Inhibitor
Name:
BDBM50192144
Synonyms:
2-(3-chloro-4-(ethyl(phenethyl)amino)phenyl)-1,1,1,3,3,3-hexafluoropropan-2-ol | CHEMBL386530
Type:
Small organic molecule
Emp. Form.:
C19H18ClF6NO
Mol. Mass.:
425.796
SMILES:
CCN(CCc1ccccc1)c1ccc(cc1Cl)C(O)(C(F)(F)F)C(F)(F)F
: