Target
11-beta-hydroxysteroid dehydrogenase 1
Ligand
BDBM50192794
Substrate
Meas. Tech.
ChEMBL_422286 (CHEMBL906986)
IC50
519±n/a nM
Citation
 Yeh, VSPatel, JRYong, HKurukulasuriya, RFung, SMonzon, KChiou, WWang, JStolarik, DImade, HBeno, DBrune, MJacobson, PSham, HLink, JT Synthesis and biological evaluation of heterocycle containing adamantane 11beta-HSD1 inhibitors. Bioorg Med Chem Lett 16:5414-9 (2006)  
Target
Name:
11-beta-hydroxysteroid dehydrogenase 1
Synonyms:
11-DH 11-beta-Hydroxysteroid Dehydrogenase 1 (11-beta-HSD1) 11beta-HSD1A Corticosteroid 11-beta-dehydrogenase isozyme 1 (11-beta-HSD-1) Hsd11 | Hsd11b1
Type:
Enzyme
Mol. Mass.:
32369.70
Organism:
Mus musculus (mouse)
Description:
P50172
Residue:
292
  
Inhibitor
Name:
BDBM50192794
Synonyms:
CHEMBL216977 | N-((1R,2S,5R,7S)-5-carbamoylmethyl-adamantan-2-yl)-2-methyl-2-[5-(4-methyl-piperazin-1-yl)-pyridin-2-yloxy]-propionamide
Type:
Small organic molecule
Emp. Form.:
C26H39N5O3
Mol. Mass.:
469.6196
SMILES:
CN1CCN(CC1)c1ccc(OC(C)(C)C(=O)N[C@H]2C3C[C@@H]4C[C@H]2C[C@](CC(N)=O)(C4)C3)nc1
: