Target
11-beta-hydroxysteroid dehydrogenase 1
Ligand
BDBM50192793
Substrate
Meas. Tech.
ChEMBL_422286 (CHEMBL906986)
IC50
74±n/a nM
Citation
 Yeh, VSPatel, JRYong, HKurukulasuriya, RFung, SMonzon, KChiou, WWang, JStolarik, DImade, HBeno, DBrune, MJacobson, PSham, HLink, JT Synthesis and biological evaluation of heterocycle containing adamantane 11beta-HSD1 inhibitors. Bioorg Med Chem Lett 16:5414-9 (2006)  
Target
Name:
11-beta-hydroxysteroid dehydrogenase 1
Synonyms:
11-DH 11-beta-Hydroxysteroid Dehydrogenase 1 (11-beta-HSD1) 11beta-HSD1A Corticosteroid 11-beta-dehydrogenase isozyme 1 (11-beta-HSD-1) Hsd11 | Hsd11b1
Type:
Enzyme
Mol. Mass.:
32369.70
Organism:
Mus musculus (mouse)
Description:
P50172
Residue:
292
  
Inhibitor
Name:
BDBM50192793
Synonyms:
3-{(1R,4S,5R,7S)-4-[2-(4-chloro-phenoxy)-2-methyl-propionylamino]-adamantan-1-yl}-propionic acid | CHEMBL219028
Type:
Small organic molecule
Emp. Form.:
C23H30ClNO4
Mol. Mass.:
419.942
SMILES:
CC(C)(Oc1ccc(Cl)cc1)C(=O)N[C@H]1C2C[C@@H]3C[C@H]1C[C@](CCC(O)=O)(C3)C2
: