Target
Melanin-concentrating hormone receptor 1
Ligand
BDBM50193624
Substrate
Meas. Tech.
ChEMBL_421230 (CHEMBL856552)
IC50
13±n/a nM
Citation
 Jiang, JLin, PHoang, MChang, LTan, CFeighner, SPalyha, OCHreniuk, DLPan, JSailer, AWMorin, NRMacNeil, DJHoward, ADVan der Ploeg, LHGoulet, MTDeVita, RJ 4-Aminoquinoline melanin-concentrating hormone 1-receptor (MCH1R) antagonists. Bioorg Med Chem Lett 16:5275-9 (2006)  
Target
Name:
Melanin-concentrating hormone receptor 1
Synonyms:
G-protein coupled receptor 24 MCH receptor 1 MCH-R1 MCHR-1 MCHR1_HUMAN Melanin-Concentrating Hormone Receptor 1 (MCH1R) Melanin-concentrating hormone receptor 1 (MCH-1) Melanin-concentrating hormone receptor 1 (MCHR-1) SLC-1 Somatostatin receptor-like protein
Type:
G Protein-Coupled Receptor (GPCR)
Mol. Mass.:
45976.27
Organism:
Homo sapiens (Human)
Description:
Membranes from CHO-K1 cells stably expressing human MCH1R were used in assays.
Residue:
422
  
Inhibitor
Name:
BDBM50193624
Synonyms:
CHEMBL424721 | N-(4-amino-2-propylquinolin-6-yl)-3-(4-(trifluoromethyl)phenyl)propanamide
Type:
Small organic molecule
Emp. Form.:
C22H22F3N3O
Mol. Mass.:
401.4248
SMILES:
CCCc1cc(N)c2cc(NC(=O)CCc3ccc(cc3)C(F)(F)F)ccc2n1
: