Target
Acetylcholinesterase
Ligand
BDBM10469
Substrate
Meas. Tech.
ChEMBL_403196 (CHEMBL869256)
IC50
31±n/a nM
Citation
 Rydberg, EHBrumshtein, BGreenblatt, HMWong, DMShaya, DWilliams, LDCarlier, PRPang, YPSilman, ISussman, JL Complexes of alkylene-linked tacrine dimers with Torpedo californica acetylcholinesterase: Binding of Bis5-tacrine produces a dramatic rearrangement in the active-site gorge. J Med Chem 49:5491-500 (2006)  
Target
Name:
Acetylcholinesterase
Synonyms:
ACES_RAT Acetylcholinesterase and butyrylcholinesterase (AChE and BChE) Acetylcholinesterase, AChE | Ache
Type:
Enzyme
Mol. Mass.:
68193.62
Organism:
Rattus norvegicus (rat)
Description:
P37136
Residue:
614
  
Inhibitor
Name:
BDBM10469
Synonyms:
Bis-THA inhibitor 1c CHEMBL424707 | N-[9-(1,2,3,4-tetrahydroacridin-9-ylamino)nonyl]-1,2,3,4-tetrahydroacridin-9-amine
Type:
Small organic molecule
Emp. Form.:
C35H44N4
Mol. Mass.:
520.7507
SMILES:
C(CCCCNc1c2CCCCc2nc2ccccc12)CCCCNc1c2CCCCc2nc2ccccc12
: