Target
Acetylcholinesterase
Ligand
BDBM8964
Substrate
Meas. Tech.
ChEMBL_403196 (CHEMBL869256)
IC50
7.8±n/a nM
Citation
 Rydberg, EHBrumshtein, BGreenblatt, HMWong, DMShaya, DWilliams, LDCarlier, PRPang, YPSilman, ISussman, JL Complexes of alkylene-linked tacrine dimers with Torpedo californica acetylcholinesterase: Binding of Bis5-tacrine produces a dramatic rearrangement in the active-site gorge. J Med Chem 49:5491-500 (2006)  
Target
Name:
Acetylcholinesterase
Synonyms:
ACES_RAT Acetylcholinesterase and butyrylcholinesterase (AChE and BChE) Acetylcholinesterase, AChE | Ache
Type:
Enzyme
Mol. Mass.:
68193.62
Organism:
Rattus norvegicus (rat)
Description:
P37136
Residue:
614
  
Inhibitor
Name:
BDBM8964
Synonyms:
CHEMBL75274 N-[8-(1,2,3,4-tetrahydroacridin-9-ylamino)octyl]-1,2,3,4-tetrahydroacridin-9-amine Tacrine-Based Inhibitor 2g
Type:
Small organic molecule
Emp. Form.:
C34H42N4
Mol. Mass.:
506.7241
SMILES:
C(CCCCNc1c2CCCCc2nc2ccccc12)CCCNc1c2CCCCc2nc2ccccc12
: