Target
Potassium voltage-gated channel subfamily A member 5
Ligand
BDBM50195800
Substrate
Meas. Tech.
ChEMBL_421994 (CHEMBL907083)
IC50
330±n/a nM
Citation
 Wu, SFluxe, ASheffer, JJanusz, JMBlass, BEWhite, RJackson, CHedges, RMurawsky, MFang, BFadayel, GMHare, MDjandjighian, L Discovery and in vitro/in vivo studies of tetrazole derivatives as Kv1.5 blockers. Bioorg Med Chem Lett 16:6213-8 (2006)  
Target
Name:
Potassium voltage-gated channel subfamily A member 5
Synonyms:
HK2 KCNA5 Potassium voltage-gated channel subfamily A member 5 Voltage-gated potassium channel subunit Kv1.5
Type:
Enzyme
Mol. Mass.:
67222.47
Organism:
Homo sapiens (Human)
Description:
P22460
Residue:
613
  
Inhibitor
Name:
BDBM50195800
Synonyms:
2-[2-(4-methoxyphenyl)ethyl]-1-[1-(4-methylphenyl)cyclopropyl]-2H-1,2,3,4,5-pentazol-1-ylium | CHEMBL387064
Type:
Small organic molecule
Emp. Form.:
C19H22N5O
Mol. Mass.:
336.4103
SMILES:
COc1ccc(CCn2nnn[n+]2C2(CC2)c2ccc(C)cc2)cc1
: