Target
Endothelin-1 receptor
Ligand
BDBM50197000
Substrate
Meas. Tech.
ChEMBL_453172 (CHEMBL902323)
IC50
7.7±n/a nM
Citation
 Doppalapudi, VRTryder, NLi, LAja, TGriffith, DLiao, FFRoxas, GRamprasad, MPBradshaw, CBarbas, CF Chemically programmed antibodies: endothelin receptor targeting CovX-Bodies. Bioorg Med Chem Lett 17:501-6 (2007)  
Target
Name:
Endothelin-1 receptor
Synonyms:
EDNRA ET-A ETA-R Endothelin receptor type A hET-AR
Type:
Enzyme Catalytic Domain
Mol. Mass.:
48736.88
Organism:
Homo sapiens (Human)
Description:
P25101
Residue:
427
  
Inhibitor
Name:
BDBM50197000
Synonyms:
CHEMBL429019 | N-(35-{[4-(3,5-dioxohexyl)phenyl]carbamoyl}-3,6,9,12,15,18,21,24,27,30,33-undecaoxapentatriacontan-1-yl)-N'-methyl-N'-{[5-(1,3-oxazol-2-yl)-2-{2-[(1,2-oxazol-5-yl)sulfamoyl]phenyl}phenyl]methyl}pentanediamide
Type:
Small organic molecule
Emp. Form.:
C62H86N6O20S
Mol. Mass.:
1267.439
SMILES:
CN(Cc1cc(ccc1-c1ccccc1S(=O)(=O)Nc1ccno1)-c1ncco1)C(=O)CCCC(=O)NCCOCCOCCOCCOCCOCCOCCOCCOCCOCCOCCOCCC(=O)Nc1ccc(CCC(=O)CC(C)=O)cc1
: