Target
Endothelin receptor type B
Ligand
BDBM50197002
Substrate
Meas. Tech.
ChEMBL_453173 (CHEMBL902324)
IC50
1910±n/a nM
Citation
 Doppalapudi, VRTryder, NLi, LAja, TGriffith, DLiao, FFRoxas, GRamprasad, MPBradshaw, CBarbas, CF Chemically programmed antibodies: endothelin receptor targeting CovX-Bodies. Bioorg Med Chem Lett 17:501-6 (2007)  
Target
Name:
Endothelin receptor type B
Synonyms:
EDNRB ENDOTHELIN B ETRB Endothelin receptor non-selective type | Endothelin receptor, ET-A/ET-B
Type:
Enzyme Catalytic Domain
Mol. Mass.:
49664.00
Organism:
Homo sapiens (Human)
Description:
ENDOTHELIN B EDNRB HUMAN::P24530
Residue:
442
  
Inhibitor
Name:
BDBM50197002
Synonyms:
CHEMBL268201 | N-[4-(3,5-dioxo-hexyl)-phenyl]-3-{2-[2-(2-{2-[4-({[2'-(isoxazol-5-ylsulfamoyl)-4-oxazol-2-yl-biphenyl-2-ylmethyl]-methyl-carbamoyl}-methyl)-phenoxy]-ethoxy}-ethoxy)-ethoxy]-ethoxy}-propionamide
Type:
Small organic molecule
Emp. Form.:
C51H57N5O13S
Mol. Mass.:
980.089
SMILES:
CN(Cc1cc(ccc1-c1ccccc1S(=O)(=O)Nc1ccno1)-c1ncco1)C(=O)Cc1ccc(OCCOCCOCCOCCOCCC(=O)Nc2ccc(CCC(=O)CC(C)=O)cc2)cc1
: