Target
Endothelin-1 receptor
Ligand
BDBM50197003
Substrate
Meas. Tech.
ChEMBL_453172 (CHEMBL902323)
IC50
1.6±n/a nM
Citation
 Doppalapudi, VRTryder, NLi, LAja, TGriffith, DLiao, FFRoxas, GRamprasad, MPBradshaw, CBarbas, CF Chemically programmed antibodies: endothelin receptor targeting CovX-Bodies. Bioorg Med Chem Lett 17:501-6 (2007)  
Target
Name:
Endothelin-1 receptor
Synonyms:
EDNRA ET-A ETA-R Endothelin receptor type A hET-AR
Type:
Enzyme Catalytic Domain
Mol. Mass.:
48736.88
Organism:
Homo sapiens (Human)
Description:
P25101
Residue:
427
  
Inhibitor
Name:
BDBM50197003
Synonyms:
CHEMBL241460 | N-[4-(3,5-dioxo-hexyl)-phenyl]-3-(2-{2-[2-({[2'-(isoxazol-5-ylsulfamoyl)-4-oxazol-2-yl-biphenyl-2-ylmethyl]-methyl-carbamoyl}-methoxy)-ethoxy]-ethoxy}-ethoxy)-propionamide
Type:
Small organic molecule
Emp. Form.:
C43H49N5O12S
Mol. Mass.:
859.94
SMILES:
CN(Cc1cc(ccc1-c1ccccc1S(=O)(=O)Nc1ccno1)-c1ncco1)C(=O)COCCOCCOCCOCCC(=O)Nc1ccc(CCC(=O)CC(C)=O)cc1
: