Target
Endothelin-1 receptor
Ligand
BDBM50197005
Substrate
Meas. Tech.
ChEMBL_453172 (CHEMBL902323)
IC50
44.9±n/a nM
Citation
 Doppalapudi, VRTryder, NLi, LAja, TGriffith, DLiao, FFRoxas, GRamprasad, MPBradshaw, CBarbas, CF Chemically programmed antibodies: endothelin receptor targeting CovX-Bodies. Bioorg Med Chem Lett 17:501-6 (2007)  
Target
Name:
Endothelin-1 receptor
Synonyms:
EDNRA ET-A ETA-R Endothelin receptor type A hET-AR
Type:
Enzyme Catalytic Domain
Mol. Mass.:
48736.88
Organism:
Homo sapiens (Human)
Description:
P25101
Residue:
427
  
Inhibitor
Name:
BDBM50197005
Synonyms:
CHEMBL436821 | N-[4-{2-[2-(2-{2-[4-(3,5-dioxo-hexyl)-phenylcarbamoyl]-ethoxy}-ethoxy)-ethoxy]-ethoxy}-2'-(isoxazol-5-ylsulfamoyl)-biphenyl-2-ylmethyl]-3,3,N-trimethyl-butyramide
Type:
Small organic molecule
Emp. Form.:
C44H56N4O11S
Mol. Mass.:
849.001
SMILES:
CN(Cc1cc(OCCOCCOCCOCCC(=O)Nc2ccc(CCC(=O)CC(C)=O)cc2)ccc1-c1ccccc1S(=O)(=O)Nc1ccno1)C(=O)CC(C)(C)C
: