Target
Tyrosine-protein phosphatase non-receptor type 1
Ligand
BDBM50198348
Substrate
Meas. Tech.
ChEMBL_432577 (CHEMBL918283)
IC50
61300±n/a nM
Citation
 Dixit, MTripathi, BKTamrakar, AKSrivastava, AKKumar, BGoel, A Synthesis of benzofuran scaffold-based potential PTP-1B inhibitors. Bioorg Med Chem 15:727-34 (2006)  
Target
Name:
Tyrosine-protein phosphatase non-receptor type 1
Synonyms:
PTN1_HUMAN PTPN1 Protein tyrosine phosphatase-1B (PTP1B) Protein-tyrosine phosphatase 1B (PTP1B) Tyrosine-protein phosphatase non-receptor type 1 (PTP1B)
Type:
Protein phosphatase
Mol. Mass.:
49963.76
Organism:
Homo sapiens (Human)
Description:
Human recombinant GST-fusion PTP1B (1-435).
Residue:
435
  
Inhibitor
Name:
BDBM50198348
Synonyms:
7-phenyl-furo[3,2-g]chromen-5-one | CHEMBL388814
Type:
Small organic molecule
Emp. Form.:
C17H10O3
Mol. Mass.:
262.2595
SMILES:
O=c1cc(oc2cc3occc3cc12)-c1ccccc1
: