Target
Tyrosine-protein phosphatase non-receptor type 1
Ligand
BDBM50198349
Substrate
Meas. Tech.
ChEMBL_432576 (CHEMBL918282)
Ki
30000±n/a nM
Citation
 Dixit, MTripathi, BKTamrakar, AKSrivastava, AKKumar, BGoel, A Synthesis of benzofuran scaffold-based potential PTP-1B inhibitors. Bioorg Med Chem 15:727-34 (2006)  
Target
Name:
Tyrosine-protein phosphatase non-receptor type 1
Synonyms:
PTN1_HUMAN PTPN1 Protein tyrosine phosphatase-1B (PTP1B) Protein-tyrosine phosphatase 1B (PTP1B) Tyrosine-protein phosphatase non-receptor type 1 (PTP1B)
Type:
Protein phosphatase
Mol. Mass.:
49963.76
Organism:
Homo sapiens (Human)
Description:
Human recombinant GST-fusion PTP1B (1-435).
Residue:
435
  
Inhibitor
Name:
BDBM50198349
Synonyms:
7-(4-methoxy-phenyl)-furo[3,2-g]chromen-5-one | CHEMBL223067
Type:
Small organic molecule
Emp. Form.:
C18H12O4
Mol. Mass.:
292.2855
SMILES:
COc1ccc(cc1)-c1cc(=O)c2cc3ccoc3cc2o1
: