Target
Sodium-dependent serotonin transporter
Ligand
BDBM50198585
Substrate
Meas. Tech.
ChEMBL_440969 (CHEMBL890059)
Ki
1.3±n/a nM
Citation
 Keith, JMGomez, LALetavic, MALy, KSJablonowski, JASeierstad, MBarbier, AJWilson, SJBoggs, JDFraser, ICMazur, CLovenberg, TWCarruthers, NI Dual serotonin transporter/histamine H3 ligands: Optimization of the H3 pharmacophore. Bioorg Med Chem Lett 17:702-6 (2007)  
Target
Name:
Sodium-dependent serotonin transporter
Synonyms:
5-HT Transporter 5HT transporter Anandamid membrane transporter, AMT Monoamine transporters; Norepinephrine & serotonin Slc6a4 Sodium-dependent serotonin transporter (SERT) | imipramine receptor
Type:
Multi-pass membrane protein
Mol. Mass.:
70168.43
Organism:
Rattus norvegicus (rat)
Description:
P31652
Residue:
630
  
Inhibitor
Name:
BDBM50198585
Synonyms:
7-(3-(4-isopropylpiperazin-1-yl)propoxy)-4-(4-methoxyphenyl)-2-methyl-1,2,3,4-tetrahydroisoquinoline | CHEMBL394787
Type:
Small organic molecule
Emp. Form.:
C27H39N3O2
Mol. Mass.:
437.6175
SMILES:
COc1ccc(cc1)C1CN(C)Cc2cc(OCCCN3CCN(CC3)C(C)C)ccc12
: