Target
Sodium-dependent serotonin transporter
Ligand
BDBM50198607
Substrate
Meas. Tech.
ChEMBL_440969 (CHEMBL890059)
Ki
1.5±n/a nM
Citation
 Keith, JMGomez, LALetavic, MALy, KSJablonowski, JASeierstad, MBarbier, AJWilson, SJBoggs, JDFraser, ICMazur, CLovenberg, TWCarruthers, NI Dual serotonin transporter/histamine H3 ligands: Optimization of the H3 pharmacophore. Bioorg Med Chem Lett 17:702-6 (2007)  
Target
Name:
Sodium-dependent serotonin transporter
Synonyms:
5-HT Transporter 5HT transporter Anandamid membrane transporter, AMT Monoamine transporters; Norepinephrine & serotonin Slc6a4 Sodium-dependent serotonin transporter (SERT) | imipramine receptor
Type:
Multi-pass membrane protein
Mol. Mass.:
70168.43
Organism:
Rattus norvegicus (rat)
Description:
P31652
Residue:
630
  
Inhibitor
Name:
BDBM50198607
Synonyms:
7-(3-(4-ethylpiperazin-1-yl)propoxy)-4-(4-methoxyphenyl)-2-methyl-1,2,3,4-tetrahydroisoquinoline | CHEMBL396459
Type:
Small organic molecule
Emp. Form.:
C26H37N3O2
Mol. Mass.:
423.5909
SMILES:
CCN1CCN(CCCOc2ccc3C(CN(C)Cc3c2)c2ccc(OC)cc2)CC1
: