Target
Histamine H3 receptor
Ligand
BDBM50205656
Substrate
Meas. Tech.
ChEMBL_454636 (CHEMBL886656)
Ki
1±n/a nM
Citation
 Letavic, MAKeith, JMLy, KSBarbier, AJBoggs, JDWilson, SJLord, BLovenberg, TWCarruthers, NI Novel naphthyridines are histamine H3 antagonists and serotonin reuptake transporter inhibitors. Bioorg Med Chem Lett 17:2566-9 (2007)  
Target
Name:
Histamine H3 receptor
Synonyms:
G-protein coupled receptor 97 HH3R HRH3 Histamine H3 receptor (H3) Histamine receptor (H3 and H4)
Type:
G Protein-Coupled Receptor (GPCR)
Mol. Mass.:
48691.47
Organism:
Homo sapiens (Human)
Description:
Binding assays were using CHO cells stably expressing hH3R receptors.
Residue:
445
  
Inhibitor
Name:
BDBM50205656
Synonyms:
4-phenyl-7-(3-(piperidin-1-yl)propoxy)-1,2,3,4-tetrahydro-2,6-naphthyridine | CHEMBL247062
Type:
Small organic molecule
Emp. Form.:
C22H29N3O
Mol. Mass.:
351.4852
SMILES:
C(COc1cc2CNCC(c3ccccc3)c2cn1)CN1CCCCC1
: