Target
Group 10 secretory phospholipase A2
Ligand
BDBM50206910
Substrate
Meas. Tech.
ChEMBL_428856 (CHEMBL917132)
IC50
900±n/a nM
Citation
 Touaibia, MDjimdé, ACao, FBoilard, EBezzine, SLambeau, GRedeuilh, CLamouri, AMassicot, FChau, FDong, CZHeymans, F Inhibition of secreted phospholipase A2. 4-glycerol derivatives of 4,5-dihydro-3-(4-tetradecyloxybenzyl)-1,2,4-4H-oxadiazol-5-one with broad activities. J Med Chem 50:1618-26 (2007)  
Target
Name:
Group 10 secretory phospholipase A2
Synonyms:
Group X secretory phospholipase A2 PLA2G10
Type:
PROTEIN
Mol. Mass.:
18153.11
Organism:
Homo sapiens (Human)
Description:
ChEMBL_1442449
Residue:
165
  
Inhibitor
Name:
BDBM50206910
Synonyms:
(+/-)-1-O-(4-cyanomethylphenyl)-3-O-[4-(4,5-dihydro-5-oxo-1,2,4-4H-oxadiazol-3-yl)methylphenyl]-2-O-octadecylglycerol | CHEMBL223880
Type:
Small organic molecule
Emp. Form.:
C38H55N3O5
Mol. Mass.:
633.8604
SMILES:
(COCc1ccc(cc1)C#N)COc1ccc(Cc2nc(=O)o[nH]2)cc1
: