Target
Phospholipase A2
Ligand
BDBM50206912
Substrate
Meas. Tech.
ChEMBL_428853 (CHEMBL917129)
IC50
15000±n/a nM
Citation
 Touaibia, MDjimdé, ACao, FBoilard, EBezzine, SLambeau, GRedeuilh, CLamouri, AMassicot, FChau, FDong, CZHeymans, F Inhibition of secreted phospholipase A2. 4-glycerol derivatives of 4,5-dihydro-3-(4-tetradecyloxybenzyl)-1,2,4-4H-oxadiazol-5-one with broad activities. J Med Chem 50:1618-26 (2007)  
Target
Name:
Phospholipase A2
Synonyms:
Group IB phospholipase A2 PLA2 PLA2G1B Phosphatidylcholine 2-acylhydrolase 1B Phospholipase A2 group 1B | phospholipase A2 precursor
Type:
Protein
Mol. Mass.:
16364.13
Organism:
Homo sapiens (Human)
Description:
P04054
Residue:
148
  
Inhibitor
Name:
BDBM50206912
Synonyms:
(+/-)-3-O-[4-(4,5-dihydro-5-oxo-1,2,4-4H-oxadiazol-3-yl)phenyl]-1-O-(4-phenylbutyl)-2-Otetradecylglycerol | CHEMBL353623
Type:
Small organic molecule
Emp. Form.:
C35H52N2O5
Mol. Mass.:
580.7978
SMILES:
CCCCCCCCCCCCCCOC(COCCCCc1ccccc1)COc1ccc(cc1)-c1nc(=O)o[nH]1
: