Target
5-hydroxytryptamine receptor 7
Ligand
BDBM50210124
Substrate
Meas. Tech.
ChEMBL_443951 (CHEMBL893116)
Ki
7.5±n/a nM
Citation
 Paillet-Loilier, MFabis, FLepailleur, ABureau, RButt-Gueulle, SDauphin, FLesnard, ADelarue, CVaudry, HRault, S Novel aminoethylbiphenyls as 5-HT7 receptor ligands. Bioorg Med Chem Lett 17:3018-22 (2007)  
Target
Name:
5-hydroxytryptamine receptor 7
Synonyms:
5-HT-7 5-HT7 5-HT7S 5HT7 HTR7 | Serotonin receptor 7
Type:
G Protein-Coupled Receptor (GPCR)
Mol. Mass.:
53573.08
Organism:
Homo sapiens (Human)
Description:
P34969
Residue:
479
  
Inhibitor
Name:
BDBM50210124
Synonyms:
2-(2'-methyl-biphenyl-3-yl)-ethylamine | CHEMBL234885
Type:
Small organic molecule
Emp. Form.:
C15H17N
Mol. Mass.:
211.3022
SMILES:
Cc1ccccc1-c1cccc(CCN)c1
: