Target
Coagulation factor X
Ligand
BDBM17643
Substrate
Meas. Tech.
ChEMBL_455363 (CHEMBL886138)
Ki
4±n/a nM
Citation
 Young, RJBrown, DBurns-Kurtis, CLChan, CConvery, MAHubbard, JAKelly, HAPateman, AJPatikis, ASenger, SShah, GPToomey, JRWatson, NSZhou, P Selective and dual action orally active inhibitors of thrombin and factor Xa. Bioorg Med Chem Lett 17:2927-30 (2007)  
Target
Name:
Coagulation factor X
Synonyms:
Activated coagulation factor X (FXa) Coagulation factor X precursor F10 Factor X heavy chain Factor Xa Stuart-Prower factor
Type:
Enzyme
Mol. Mass.:
54726.60
Organism:
Homo sapiens (Human)
Description:
Residue:
488
  
Inhibitor
Name:
BDBM17643
Synonyms:
(E)-2-(5-chlorothiophen-2-yl)-N-[(3S)-1-[(2S)-1-(morpholin-4-yl)-1-oxopropan-2-yl]-2-oxopyrrolidin-3-yl]ethene-1-sulfonamide N-[(3S)-2-oxopyrrolidin-3-yl]sulfonamide, 1f
Type:
Small organic molecule
Emp. Form.:
C17H22ClN3O5S2
Mol. Mass.:
447.957
SMILES:
C[C@H](N1CC[C@H](NS(=O)(=O)\C=C\c2ccc(Cl)s2)C1=O)C(=O)N1CCOCC1
: