Target
Cyclin-dependent kinase 2
Ligand
BDBM50211436
Substrate
Meas. Tech.
ChEMBL_455593 (CHEMBL886373)
IC50
123±n/a nM
Citation
 Alam, MBeevers, RECeska, TDavenport, RJDickson, KMFortunato, MGowers, LHaughan, AFJames, LAJones, MWKinsella, NLowe, CMeissner, JWNicolas, ALPerry, BGPhillips, DJPitt, WRPlatt, ARatcliffe, AJSharpe, ATait, LJ Synthesis and SAR of aminopyrimidines as novel c-Jun N-terminal kinase (JNK) inhibitors. Bioorg Med Chem Lett 17:3463-7 (2007)  
Target
Name:
Cyclin-dependent kinase 2
Synonyms:
CDK2 CDK2_HUMAN Cell division protein kinase 2 Protein cereblon/Cyclin-dependent kinase 2 | p33 protein kinase
Type:
Enzyme Subunit
Mol. Mass.:
33938.17
Organism:
Homo sapiens (Human)
Description:
P24941
Residue:
298
  
Inhibitor
Name:
BDBM50211436
Synonyms:
2-(4-(5-chloro-4-(1H-indol-3-yl)pyrimidin-2-ylamino)piperidin-1-yl)-N-methylacetamide | CHEMBL245336
Type:
Small organic molecule
Emp. Form.:
C20H23ClN6O
Mol. Mass.:
398.889
SMILES:
CNC(=O)CN1CCC(CC1)Nc1ncc(Cl)c(n1)-c1c[nH]c2ccccc12
: