Target
cGMP-dependent protein kinase
Ligand
BDBM50182361
Substrate
Meas. Tech.
ChEMBL_447195 (CHEMBL897494)
IC50
0.28±n/a nM
Citation
 Liang, GBQian, XFeng, DFisher, MBrown, CMGurnett, ALeavitt, PSLiberator, PAMisura, ASTamas, TSchmatz, DMWyvratt, MBiftu, T Synthesis and SAR studies of potent imidazopyridine anticoccidial agents. Bioorg Med Chem Lett 17:3558-61 (2007)  
Target
Name:
cGMP-dependent protein kinase
Synonyms:
Type:
PROTEIN
Mol. Mass.:
112911.27
Organism:
Eimeria tenella
Description:
ChEMBL_469577
Residue:
1003
  
Inhibitor
Name:
BDBM50182361
Synonyms:
4-(7-((dimethylamino)methyl)-2-(4-fluorophenyl)H-imidazo[1,2-a]pyridin-3-yl)-N-neopentylpyrimidin-2-amine | CHEMBL445397
Type:
Small organic molecule
Emp. Form.:
C25H29FN6
Mol. Mass.:
432.5364
SMILES:
CN(C)Cc1ccn2c(c(nc2c1)-c1ccc(F)cc1)-c1ccnc(NCC(C)(C)C)n1
: