Target
Vascular endothelial growth factor receptor 2
Ligand
BDBM50211983
Substrate
Meas. Tech.
ChEMBL_447209 (CHEMBL897508)
Ki
80±n/a nM
Citation
 Kiselyov, ASMilligan, DOuyang, X Novel inhibitors of VEGF receptors-1 and -2 based on azole-5-carboxamide templates. Bioorg Med Chem Lett 17:3550-7 (2007)  
Target
Name:
Vascular endothelial growth factor receptor 2
Synonyms:
CD_antigen=CD309 Fetal liver kinase 1 (FLK-1) KDR Protein-tyrosine kinase receptor Flk-1 VEGFR-2 VEGFR2 Vascular Endothelial Growth Factor Receptor Kinase 2 Vascular endothelial growth factor receptor 2 (KDR) Vascular endothelial growth factor receptor 2 (VEGFR2) Vascular endothelial growth factor receptor-2 (VEGFR-2)
Type:
Receptor Tyrosine Kinase
Mol. Mass.:
151510.97
Organism:
Homo sapiens (Human)
Description:
P35968
Residue:
1356
  
Inhibitor
Name:
BDBM50211983
Synonyms:
1-(2-(pyridin-4-yl)ethyl)-N-(4-(trifluoromethoxy)phenyl)-1H-pyrazole-5-carboxamide | CHEMBL236205
Type:
Small organic molecule
Emp. Form.:
C18H15F3N4O2
Mol. Mass.:
376.3325
SMILES:
FC(F)(F)Oc1ccc(NC(=O)c2ccnn2CCc2ccncc2)cc1
: