Target
Vascular endothelial growth factor receptor 2
Ligand
BDBM50211992
Substrate
Meas. Tech.
ChEMBL_447202 (CHEMBL897502)
Ki
70±n/a nM
Citation
 Kiselyov, ASMilligan, DOuyang, X Novel inhibitors of VEGF receptors-1 and -2 based on azole-5-carboxamide templates. Bioorg Med Chem Lett 17:3550-7 (2007)  
Target
Name:
Vascular endothelial growth factor receptor 2
Synonyms:
CD_antigen=CD309 Fetal liver kinase 1 (FLK-1) KDR Protein-tyrosine kinase receptor Flk-1 VEGFR-2 VEGFR2 Vascular Endothelial Growth Factor Receptor Kinase 2 Vascular endothelial growth factor receptor 2 (KDR) Vascular endothelial growth factor receptor 2 (VEGFR2) Vascular endothelial growth factor receptor-2 (VEGFR-2)
Type:
Receptor Tyrosine Kinase
Mol. Mass.:
151510.97
Organism:
Homo sapiens (Human)
Description:
P35968
Residue:
1356
  
Inhibitor
Name:
BDBM50211992
Synonyms:
CHEMBL236419 | N-(4-(chlorodifluoromethoxy)phenyl)-1-(2-(pyridin-4-yl)ethyl)-1H-pyrazole-5-carboxamide
Type:
Small organic molecule
Emp. Form.:
C18H15ClF2N4O2
Mol. Mass.:
392.787
SMILES:
FC(F)(Cl)Oc1cccc(NC(=O)c2ccnn2CCc2ccncc2)c1
: