Target
Fatty acid-binding protein, adipocyte
Ligand
BDBM50212878
Substrate
Meas. Tech.
ChEMBL_455933 (CHEMBL887934)
Ki
36±n/a nM
Citation
 Sulsky, RMagnin, DRHuang, YSimpkins, LTaunk, PPatel, MZhu, YStouch, TRBassolino-Klimas, DParker, RHarrity, TStoffel, RTaylor, DSLavoie, TBKish, KJacobson, BLSheriff, SAdam, LPEwing, WRRobl, JA Potent and selective biphenyl azole inhibitors of adipocyte fatty acid binding protein (aFABP). Bioorg Med Chem Lett 17:3511-5 (2007)  
Target
Name:
Fatty acid-binding protein, adipocyte
Synonyms:
A-FABP ALBP FABP4 Fatty acid binding protein adipocyte Fatty acid-binding protein 4 (FABP4)
Type:
Enzyme
Mol. Mass.:
14719.23
Organism:
Homo sapiens (Human)
Description:
P15090
Residue:
132
  
Inhibitor
Name:
BDBM50212878
Synonyms:
CHEMBL246902 | [2'-(4,5-diphenyl-furan-2-yl)-biphenyl-3-yloxy]-acetic acid
Type:
Small organic molecule
Emp. Form.:
C30H22O4
Mol. Mass.:
446.4933
SMILES:
OC(=O)COc1cccc(c1)-c1ccccc1-c1cc(c(o1)-c1ccccc1)-c1ccccc1
: