Target
Amine oxidase [flavin-containing] A
Ligand
BDBM50213676
Substrate
Meas. Tech.
ChEMBL_436975 (CHEMBL885991)
Ki
54±n/a nM
Citation
 Fierro, AOsorio-Olivares, MCassels, BKEdmondson, DESepúlveda-Boza, SReyes-Parada, M Human and rat monoamine oxidase-A are differentially inhibited by (S)-4-alkylthioamphetamine derivatives: insights from molecular modeling studies. Bioorg Med Chem 15:5198-206 (2007)  
Target
Name:
Amine oxidase [flavin-containing] A
Synonyms:
AOFA_RAT Amine oxidase [flavin-containing] A Monoamine Oxidase Type A (MAO-A) Monoamine oxidase A (MAO-A) Monoamine oxidase type A (MAOA)
Type:
Enzyme
Mol. Mass.:
59515.21
Organism:
Rattus norvegicus (rat)
Description:
Residue:
526
  
Inhibitor
Name:
BDBM50213676
Synonyms:
(S)-2-amino-1-(4-ethylthiophenyl)-propane | CHEMBL387777
Type:
Small organic molecule
Emp. Form.:
C11H17NS
Mol. Mass.:
195.324
SMILES:
CCSc1ccc(C[C@H](C)N)cc1
: