Target
Peroxisome proliferator-activated receptor gamma
Ligand
BDBM50213714
Substrate
Meas. Tech.
ChEMBL_438927 (CHEMBL889270)
EC50
>1000±n/a nM
Citation
 Zhang, RWang, ADeAngelis, APelton, PXu, JZhu, PZhou, LDemarest, KMurray, WVKuo, GH Discovery of para-alkylthiophenoxyacetic acids as a novel series of potent and selective PPARdelta agonists. Bioorg Med Chem Lett 17:3855-9 (2007)  
Target
Name:
Peroxisome proliferator-activated receptor gamma
Synonyms:
NR1C3 PPAR-gamma PPARG_HUMAN Peroxisome proliferator-activated receptor gamma (PPAR gamma) Peroxisome proliferator-activated receptor gamma (PPARĪ³) peroxisome proliferator-activated receptor gamma isoform 2
Type:
Nuclear Receptor
Mol. Mass.:
57613.46
Organism:
Homo sapiens (Human)
Description:
P37231
Residue:
505
  
Inhibitor
Name:
BDBM50213714
Synonyms:
(R)-2-(4-(2-ethoxy-3-(4-(trifluoromethyl)phenoxy)propylthio)-2-methylphenoxy)acetic acid | CHEMBL230158
Type:
Small organic molecule
Emp. Form.:
C21H23F3O5S
Mol. Mass.:
444.465
SMILES:
CCO[C@H](COc1ccc(cc1)C(F)(F)F)CSc1ccc(OCC(O)=O)c(C)c1
: