Target
Melanocortin receptor 4
Ligand
BDBM50220706
Substrate
Meas. Tech.
ChEMBL_457383 (CHEMBL941902)
IC50
52±n/a nM
Citation
 Sebhat, IKLai, YBarakat, KYe, ZTang, RKalyani, RNVongs, AMacneil, TWeinberg, DHCabello, MAMaroto, MTeran, AFong, TMVan der Ploeg, LHPatchett, AANargund, RP Melanocortin subtype 4 receptor agonists: structure-activity relationships about the 4-alkyl piperidine core. Bioorg Med Chem Lett 17:5720-3 (2007)  
Target
Name:
Melanocortin receptor 4
Synonyms:
MC4-R MC4R_HUMAN Melanocortin receptor 4 (MC-4) Melanocortin receptor 4 (MC4R)
Type:
Enzyme
Mol. Mass.:
36949.50
Organism:
Homo sapiens (Human)
Description:
P32245
Residue:
332
  
Inhibitor
Name:
BDBM50220706
Synonyms:
(R)-N-((S)-1-(4-benzyl-4-((1-methyl-1H-tetrazol-5-yl)methyl)piperidin-1-yl)-3-(4-chlorophenyl)-1-oxopropan-2-yl)-1,2,3,4-tetrahydroisoquinoline-3-carboxamide | CHEMBL398487
Type:
Small organic molecule
Emp. Form.:
C34H38ClN7O2
Mol. Mass.:
612.164
SMILES:
Cn1nnnc1CC1(Cc2ccccc2)CCN(CC1)C(=O)[C@H](Cc1ccc(Cl)cc1)NC(=O)[C@H]1Cc2ccccc2CN1
: