Target
Melanocortin receptor 4
Ligand
BDBM50220707
Substrate
Meas. Tech.
ChEMBL_457383 (CHEMBL941902)
IC50
343±n/a nM
Citation
 Sebhat, IKLai, YBarakat, KYe, ZTang, RKalyani, RNVongs, AMacneil, TWeinberg, DHCabello, MAMaroto, MTeran, AFong, TMVan der Ploeg, LHPatchett, AANargund, RP Melanocortin subtype 4 receptor agonists: structure-activity relationships about the 4-alkyl piperidine core. Bioorg Med Chem Lett 17:5720-3 (2007)  
Target
Name:
Melanocortin receptor 4
Synonyms:
MC4-R MC4R_HUMAN Melanocortin receptor 4 (MC-4) Melanocortin receptor 4 (MC4R)
Type:
Enzyme
Mol. Mass.:
36949.50
Organism:
Homo sapiens (Human)
Description:
P32245
Residue:
332
  
Inhibitor
Name:
BDBM50220707
Synonyms:
(R)-N-((S)-1-(4-(tert-butylcarbamoyl)-4-(4-oxocyclohex-2-enyl)piperidin-1-yl)-3-(4-fluorophenyl)-1-oxopropan-2-yl)-4-methylpiperazine-2-carboxamide | CHEMBL398932
Type:
Small organic molecule
Emp. Form.:
C31H44FN5O4
Mol. Mass.:
569.7106
SMILES:
CN1CCN[C@H](C1)C(=O)N[C@@H](Cc1ccc(F)cc1)C(=O)N1CCC(CC1)(C1CCC(=O)C=C1)C(=O)NC(C)(C)C
: