Target
Melanocortin receptor 4
Ligand
BDBM50220697
Substrate
Meas. Tech.
ChEMBL_457383 (CHEMBL941902)
IC50
64±n/a nM
Citation
 Sebhat, IKLai, YBarakat, KYe, ZTang, RKalyani, RNVongs, AMacneil, TWeinberg, DHCabello, MAMaroto, MTeran, AFong, TMVan der Ploeg, LHPatchett, AANargund, RP Melanocortin subtype 4 receptor agonists: structure-activity relationships about the 4-alkyl piperidine core. Bioorg Med Chem Lett 17:5720-3 (2007)  
Target
Name:
Melanocortin receptor 4
Synonyms:
MC4-R MC4R_HUMAN Melanocortin receptor 4 (MC-4) Melanocortin receptor 4 (MC4R)
Type:
Enzyme
Mol. Mass.:
36949.50
Organism:
Homo sapiens (Human)
Description:
P32245
Residue:
332
  
Inhibitor
Name:
BDBM50220697
Synonyms:
(R)-N-((S)-1-(4-(tert-butylcarbamoyl)-4-(cyclohex-2-enyl)piperidin-1-yl)-3-(4-fluorophenyl)-1-oxopropan-2-yl)-4-methylpiperazine-2-carboxamide | CHEMBL250719
Type:
Small organic molecule
Emp. Form.:
C31H46FN5O3
Mol. Mass.:
555.727
SMILES:
CN1CCN[C@H](C1)C(=O)N[C@@H](Cc1ccc(F)cc1)C(=O)N1CCC(CC1)(C1CCCC=C1)C(=O)NC(C)(C)C
: