Target
Glutamate receptor ionotropic, NMDA 2B
Ligand
BDBM50220727
Substrate
Meas. Tech.
ChEMBL_449356 (CHEMBL899623)
IC50
59±n/a nM
Citation
 Kawai, MNakamura, HSakurada, IShimokawa, HTanaka, HMatsumizu, MAndo, KHattori, KOhta, ANukui, SOmura, AKawamura, M Discovery of novel and orally active NR2B-selective N-methyl-D-aspartate (NMDA) antagonists, pyridinol derivatives with reduced HERG binding affinity. Bioorg Med Chem Lett 17:5533-6 (2007)  
Target
Name:
Glutamate receptor ionotropic, NMDA 2B
Synonyms:
GluN2B Grin2b NMDA receptor subunit N2B (GluN2B) NMDE2_RAT | NR2B
Type:
Protein
Mol. Mass.:
166077.66
Organism:
Rattus norvegicus (Rat)
Description:
Q00960
Residue:
1482
  
Inhibitor
Name:
BDBM50220727
Synonyms:
CHEMBL237534 | N-((1r,4r)-4-(3-fluoro-4-hydroxyphenyl)cyclohexyl)-3-phenylpropanamide
Type:
Small organic molecule
Emp. Form.:
C21H24FNO2
Mol. Mass.:
341.4192
SMILES:
Oc1ccc(cc1F)[C@H]1CC[C@@H](CC1)NC(=O)CCc1ccccc1
: