Target
5-hydroxytryptamine receptor 6
Ligand
BDBM50223286
Substrate
Meas. Tech.
ChEMBL_458154 (CHEMBL924411)
Ki
462±n/a nM
Citation
 Tasler, SKraus, JWuzik, AMüller, OAschenbrenner, ACubero, EPascual, RQuintana-Ruiz, JRDordal, AMercè, RCodony, X Discovery of 5-HT6 receptor ligands based on virtual HTS. Bioorg Med Chem Lett 17:6224-9 (2007)  
Target
Name:
5-hydroxytryptamine receptor 6
Synonyms:
5-HT-6 5-hydroxytryptamine receptor 6 (5-HT-6) 5-hydroxytryptamine receptor 6 (5HT6) HTR6 Serotonin 6 (5-HT6) receptor | Serotonin Receptor 6
Type:
G Protein-Coupled Receptor (GPCR)
Mol. Mass.:
46968.43
Organism:
Homo sapiens (Human)
Description:
P50406
Residue:
440
  
Inhibitor
Name:
BDBM50223286
Synonyms:
CHEMBL250804 | methyl 4-(4-methylpiperazin-1-yl)-2-(phenethylamino)benzoate
Type:
Small organic molecule
Emp. Form.:
C21H27N3O2
Mol. Mass.:
353.458
SMILES:
COC(=O)c1ccc(cc1NCCc1ccccc1)N1CCN(C)CC1
: