Target
Proto-oncogene tyrosine-protein kinase Src
Ligand
BDBM50142880
Substrate
Meas. Tech.
ChEMBL_450769 (CHEMBL899855)
Ki
700±n/a nM
Citation
 Manetti, FSantucci, ALocatelli, GAMaga, GSpreafico, ASerchi, TOrlandini, MBernardini, GCaradonna, NPSpallarossa, ABrullo, CSchenone, SBruno, ORanise, ABondavalli, FHoffmann, OBologna, MAngelucci, ABotta, M Identification of a novel pyrazolo[3,4-d]pyrimidine able to inhibit cell proliferation of a human osteogenic sarcoma in vitro and in a xenograft model in mice. J Med Chem 50:5579-88 (2007)  
Target
Name:
Proto-oncogene tyrosine-protein kinase Src
Synonyms:
Calmodulin/Proto-oncogene tyrosine-protein kinase Src Proto-oncogene c-Src SRC SRC_HUMAN V-src sarcoma (Schmidt-Ruppin A-2) viral oncogene homolog (avian) p60-Src | pp60c-src
Type:
Protein
Mol. Mass.:
59838.60
Organism:
Homo sapiens (Human)
Description:
P12931
Residue:
536
  
Inhibitor
Name:
BDBM50142880
Synonyms:
1-(2-chloro-2-phenylethyl)-6-(methylthio)-N-phenethyl-1H-pyrazolo[3,4-d]pyrimidin-4-amine [1-(2-Chloro-2-phenyl-ethyl)-6-methylsulfanyl-1H-pyrazolo[3,4-d]pyrimidin-4-yl]-phenethyl-amine
Type:
Small organic molecule
Emp. Form.:
C22H22ClN5S
Mol. Mass.:
423.962
SMILES:
CSc1nc(NCCc2ccccc2)c2cnn(CC(Cl)c3ccccc3)c2n1
: