Target
Tyrosine-protein phosphatase non-receptor type 2
Ligand
BDBM50228010
Substrate
Meas. Tech.
ChEMBL_461677 (CHEMBL927698)
IC50
170±n/a nM
Citation
 Douty, BWayland, BAla, PJBower, MJPruitt, JBostrom, LWei, MKlabe, RGonneville, LWynn, RBurn, TCLiu, PCCombs, APYue, EW Isothiazolidinone inhibitors of PTP1B containing imidazoles and imidazolines. Bioorg Med Chem Lett 18:66-71 (2008)  
Target
Name:
Tyrosine-protein phosphatase non-receptor type 2
Synonyms:
PTN2_HUMAN PTPT T-cell protein-tyrosine phosphatase TCPTP Tyrosine-protein phosphatase non-receptor type 2 (TC-PTP)
Type:
Protein
Mol. Mass.:
48481.80
Organism:
Homo sapiens (Human)
Description:
P17706
Residue:
415
  
Inhibitor
Name:
BDBM50228010
Synonyms:
2-[3-(2-{1-(3-fluoro-benzenesulfonylamino)-2-[3-methyl-4-(1,1,3-trioxo-1lambda6-isothiazolidin-5-yl)-phenyl]-ethyl}-3H-imidazol-4-yl)-propoxy]-6-hydroxy-benzoic acid methyl ester | CHEMBL253501
Type:
Small organic molecule
Emp. Form.:
C32H33FN4O9S2
Mol. Mass.:
700.754
SMILES:
COC(=O)c1c(O)cccc1OCCCc1cnc([nH]1)C(Cc1ccc(C2CC(=O)NS2(=O)=O)c(C)c1)NS(=O)(=O)c1cccc(F)c1
: