Target
Tyrosine-protein phosphatase non-receptor type 1
Ligand
BDBM50228025
Substrate
Meas. Tech.
ChEMBL_461676 (CHEMBL927697)
IC50
110±n/a nM
Citation
 Douty, BWayland, BAla, PJBower, MJPruitt, JBostrom, LWei, MKlabe, RGonneville, LWynn, RBurn, TCLiu, PCCombs, APYue, EW Isothiazolidinone inhibitors of PTP1B containing imidazoles and imidazolines. Bioorg Med Chem Lett 18:66-71 (2008)  
Target
Name:
Tyrosine-protein phosphatase non-receptor type 1
Synonyms:
PTN1_HUMAN PTPN1 Protein tyrosine phosphatase-1B (PTP1B) Protein-tyrosine phosphatase 1B (PTP1B) Tyrosine-protein phosphatase non-receptor type 1 (PTP1B)
Type:
Protein phosphatase
Mol. Mass.:
49963.76
Organism:
Homo sapiens (Human)
Description:
Human recombinant GST-fusion PTP1B (1-435).
Residue:
435
  
Inhibitor
Name:
BDBM50228025
Synonyms:
2-[4-((R)-2-{1-(3-fluoro-benzenesulfonylamino)-2-[3-methyl-4-(1,1,3-trioxo-1lambda6-isothiazolidin-5-yl)-phenyl]-ethyl}-4,5-dihydro-3H-imidazol-4-yl)-butoxy]-6-hydroxy-benzoic acid methyl ester | CHEMBL253270
Type:
Small organic molecule
Emp. Form.:
C33H37FN4O9S2
Mol. Mass.:
716.797
SMILES:
COC(=O)c1c(O)cccc1OCCCC[C@@H]1CN=C(N1)C(Cc1ccc(C2CC(=O)NS2(=O)=O)c(C)c1)NS(=O)(=O)c1cccc(F)c1
: