Target
Sterol O-acyltransferase 1
Ligand
BDBM50250331
Substrate
Meas. Tech.
ChEMBL_528841 (CHEMBL977683)
IC50
44000±n/a nM
Citation
 Nishimura, KFukuda, TMiyase, TNoguchi, HChen, XM Activity-guided isolation of triterpenoid acyl CoA cholesteryl acyl transferase (ACAT) inhibitors from Ilex kudincha. J Nat Prod 62:1061-4 (1999)  
Target
Name:
Sterol O-acyltransferase 1
Synonyms:
ACAT-1 Acat SOAT1_RAT Sterol O-acyltransferase, Soat
Type:
PROTEIN
Mol. Mass.:
64165.56
Organism:
Rattus norvegicus
Description:
ChEMBL_28796
Residue:
545
  
Inhibitor
Name:
BDBM50250331
Synonyms:
2alpha, 3beta-dihydroxy-24-nor-urs-4(23),12-dien-28-oic acid | CHEMBL523827
Type:
Small organic molecule
Emp. Form.:
C29H44O4
Mol. Mass.:
456.6573
SMILES:
C[C@@H]1CC[C@@]2(CC[C@]3(C)C(=CC[C@@H]4[C@@]5(C)C[C@@H](O)[C@H](O)C(=C)[C@@H]5CC[C@@]34C)[C@@H]2[C@H]1C)C(O)=O
: