Target
5-hydroxytryptamine receptor 2A
Ligand
BDBM50250839
Substrate
Meas. Tech.
ChEMBL_486952 (CHEMBL1012214)
Ki
>100000±n/a nM
Citation
 Hu, JFSchetz, JAKelly, MPeng, JNAng, KKFlotow, HLeong, CYNg, SBBuss, ADWilkins, SPHamann, MT New antiinfective and human 5-HT2 receptor binding natural and semisynthetic compounds from the Jamaican sponge Smenospongia aurea. J Nat Prod 65:476-80 (2002)  
Target
Name:
5-hydroxytryptamine receptor 2A
Synonyms:
5-HT-2 5-HT2A 5-hydroxytryptamine receptor 2A (5HT-2A) 5HT2A_HUMAN HTR2A | Serotonin receptor 2A
Type:
undefined
Mol. Mass.:
52607.65
Organism:
Homo sapiens (Human)
Description:
P28223
Residue:
471
  
Inhibitor
Name:
BDBM50250839
Synonyms:
6-bromo-2'-de-N-methylaplysinopsin CHEMBL511879
Type:
Small organic molecule
Emp. Form.:
C13H11BrN4O
Mol. Mass.:
319.157
SMILES:
CN1C(N)=NC(=Cc2c[nH]c3cc(Br)ccc23)C1=O
: