Target
5-hydroxytryptamine receptor 2C
Ligand
BDBM50250841
Substrate
Meas. Tech.
ChEMBL_486953 (CHEMBL1012215)
Ki
3500±n/a nM
Citation
 Hu, JFSchetz, JAKelly, MPeng, JNAng, KKFlotow, HLeong, CYNg, SBBuss, ADWilkins, SPHamann, MT New antiinfective and human 5-HT2 receptor binding natural and semisynthetic compounds from the Jamaican sponge Smenospongia aurea. J Nat Prod 65:476-80 (2002)  
Target
Name:
5-hydroxytryptamine receptor 2C
Synonyms:
5-HT-1C 5-HT1C 5-HT2C-INI 5-HTR2C 5-hydroxytryptamine receptor 2C (5-HT-2C) 5HT-1C HTR1C Serotonin (5-HT3) receptor Serotonin Receptor 2C
Type:
G Protein-Coupled Receptor (GPCR)
Mol. Mass.:
51836.79
Organism:
Homo sapiens (Human)
Description:
P28335
Residue:
458
  
Inhibitor
Name:
BDBM50250841
Synonyms:
CHEMBL463250 | N-3'-ethylaplysinopsin
Type:
Small organic molecule
Emp. Form.:
C16H18N4O
Mol. Mass.:
282.3403
SMILES:
CC\N=C1/N(C)C(=O)\C(=C/c2c[nH]c3ccccc23)N1C
: