Target
5-hydroxytryptamine receptor 2A
Ligand
BDBM50250841
Substrate
Meas. Tech.
ChEMBL_486952 (CHEMBL1012214)
Ki
1700±n/a nM
Citation
 Hu, JFSchetz, JAKelly, MPeng, JNAng, KKFlotow, HLeong, CYNg, SBBuss, ADWilkins, SPHamann, MT New antiinfective and human 5-HT2 receptor binding natural and semisynthetic compounds from the Jamaican sponge Smenospongia aurea. J Nat Prod 65:476-80 (2002)  
Target
Name:
5-hydroxytryptamine receptor 2A
Synonyms:
5-HT-2 5-HT2A 5-hydroxytryptamine receptor 2A (5HT-2A) 5HT2A_HUMAN HTR2A | Serotonin receptor 2A
Type:
undefined
Mol. Mass.:
52607.65
Organism:
Homo sapiens (Human)
Description:
P28223
Residue:
471
  
Inhibitor
Name:
BDBM50250841
Synonyms:
CHEMBL463250 | N-3'-ethylaplysinopsin
Type:
Small organic molecule
Emp. Form.:
C16H18N4O
Mol. Mass.:
282.3403
SMILES:
CC\N=C1/N(C)C(=O)\C(=C/c2c[nH]c3ccccc23)N1C
: